شیل اسمیتویک
type: Concept
broader: پنسیلوانین
preferred label: Smithwick Shale @en
related: تگزاس
scope note: پنسیلوانین زیرین و میانی در گروه بند. مرکز تگزاس

پنسیلوانین
type: Concept
narrower: شیل اسمیتویک
preferred label: Pennsylvanian @en

تگزاس
type: Concept
preferred label: Texas @en
related: شیل اسمیتویک