شناوری قاره‌ای
type: Concept
preferred label: continental drift @en
related: پاراتتیس

تتیس(اقیانوس)
type: Concept
preferred label: Tethys @en
related: پاراتتیس

پاراتتیس
type: Concept
preferred label: Paratethys @en
related: شناوری قاره‌ای
related: تتیس(اقیانوس)
scope note: دریای دوره میوسن (دوران سوم). باقیمانده دریای تتیس اصلی که محدوده آن تا شمال کارپات، دریای سیاه بوده و رسوبات آن به اشکوب‌های منطقه‌ای تقسیم می شوند