هگزاکتینلیدا
type: Concept
broader: اسفنج
preferred label: Hexactinellida @en
scope note: رده اسفنج‌ها. افراد این گروه با داشتن سوزن‌های شش محوری سیلیسی از رده دیگر اسفنج‌ها متمایز می‌باشند، اسکلت شیشه مانند آن‌ها شامل سوزن‌های منفرد یا متصل به هم است که ساختمان کم و بیش محکمی را به وجود آورده‌اند.

اسفنج
type: Concept
narrower: هگزاکتینلیدا
preferred label: Porifera @en