مارسانان
type: Concept
broader: ستاره‌وش
preferred label: Ophiuroidea @en
scope note: فسیل شعاعیان. ستارگان دریایی. رده‌ای از خارپوستان که دارای بازوهای طویل و باریک متحرک هستند

ستاره‌وش
type: Concept
narrower: مارسانان
preferred label: Stelleroidea @en