هیدروزوا
type: Concept
broader: کیسه تنان
preferred label: Hydrozoa @en
scope note: رده‌ای از کیسه‌تنان، زیرشاخه کنیداریا، که شامل: هیدروئیدها، مرجان‌های گزنده و غیره می‌باشد. پولیپ‌ها و مدوزها اغلب کوچک هستند ولی کلنی‌های بزرگ به وجود می‌آورند. تناوب نسل‌ها در چرخه زندگی آنها مشخص است. از دوره کامبرین زیرین تا حال موجودند.

کیسه تنان
type: Concept
narrower: هیدروزوا
preferred label: Coelenterata @en