دنتالیم
type: Concept
broader: ناوپایان
preferred label: dentalium @en
scope note: نام جنس نوعی نرم تن ناوی شکل دوران سوم و کنونی. گونه های مشابه آن در دونین شناخته شده است.

ناوپایان
type: Concept
narrower: دنتالیم
preferred label: Scaphopoda @en