دنتالیم
type: Concept
broader: ناوپایان
preferred label: dentalium @en

ناوپایان
type: Concept
broader: نرم تنان
narrower: دنتالیم
preferred label: Scaphopoda @en
scope note: رده کوچکی از نرم‌تنان دریایی که برای نقب زدن و سوراخ کردن ویژگی یافته‌اند صدف آنها که شبیه عاج است لوله‌ای بوده و دو انتهایش باز است

نرم تنان
type: Concept
narrower: ناوپایان
preferred label: Mollusca @en