بلور انباشتی
type: Concept
broader: بلور
preferred label: cumulate crystal @en
scope note: بلور نمک حاصل از تبلور شورابه‏ها که در مرز بین هوا و آب تشکیل می‌شود

بلور
type: Concept
narrower: بلور انباشتی
preferred label: crystal @en