بلور دگرگونی
type: Concept
broader: بلور
preferred label: metacryst @en
scope note: بلور درشتی که براثر بازبلورش در یک سنگ دگرگونی تشکیل شده است

بلور
type: Concept
narrower: بلور دگرگونی
preferred label: crystal @en