بلورهای قلوه‌ای
type: Concept
broader: بلور
preferred label: reniform crystals @en
scope note: بلورهای شعاعی که توده‌های گرد قلوه‌ای می‌سازند

بلور
type: Concept
narrower: بلورهای قلوه‌ای
preferred label: crystal @en