بلورهای گویچه‌ای
type: Concept
broader: بلور
preferred label: globular crystals @en
scope note: تک‌بلورهای شعاعی که الگویی کروی یا نیمه‌کروی کوچک می‌سازند

بلور
type: Concept
narrower: بلورهای گویچه‌ای
preferred label: crystal @en