بلورهای مشبک
type: Concept
broader: بلور
preferred label: reticulated crystals @en
scope note: بلورهای سوزنی که درهم‌رشدی‌های تورمانند به وجود می‌آورند

بلور
type: Concept
narrower: بلورهای مشبک
preferred label: crystal @en