بلورهای هم‌مرکز
type: Concept
broader: بلور
preferred label: concentric crystals @en
scope note: لایه‌های تقریباً کروی دارای یک مرکز مشترک

بلور
type: Concept
narrower: بلورهای هم‌مرکز
preferred label: crystal @en