زمین‌شیمی
type: Concept
preferred label: geochemistry @en
related: بسپارش

بسپارش
type: Concept
preferred label: polymerization @en
related: بسپار
related: زمین‌شیمی
scope note: ترکیب ذرات همسان باری و تشکیل واحد بزرگتر را بسپارش گویند

بسپار
type: Concept
preferred label: polymer @en
related: بسپارش