شیستوزیته صفحه محوری
type: Concept
broader: شیستوزیته
preferred label: axial plane schistosity @en
scope note: شیستوریته در سنگ‌ها که به موازات صفحۀ محوری چین توسعه یافته است

شیستوزیته
type: Concept
narrower: شیستوزیته صفحه محوری
preferred label: schistosity @en