برداشت آب زیرزمینی
type: Concept
preferred label: ground water withdraw @en
related: آب زیرزمینی
scope note: فرایند بیرون کشیدن آب زیرزمینی از یک منبع آب

آب زیرزمینی
type: Concept
preferred label: ground water @en
related: برداشت آب زیرزمینی