رسوب
type: Concept
preferred label: sediment @en
related: بَرجاذره

حوضه رسوبی
type: Concept
preferred label: sedimentary basin @en
related: بَرجاذره

بَرجاذره
type: Concept
preferred label: orthochem @en
related: حوضه رسوبی
related: رسوب
scope note: رسوبی شیمیایی تشکیل شده در درون حوضۀ رسوبی یا در درون حجم رسوب، بدون آثار جابه‌جایی