بافتار همسان‌گرد
type: Concept
broader: بافتار
preferred label: isotropic fabric @en
scope note: بافتاری تصادفی که از همۀ جهت‌ها یکسان به‌ نظر می‌رسد

بافتار
type: Concept
narrower: بافتار همسان‌گرد
preferred label: fabric @en