بافتار همه‌جوردانه
type: Concept
broader: بافتار
preferred label: seriate fabric @en
scope note: بافتاری نابرابردانه که در آن بلورهایی با اندازه‌های مختلف وجود دارد

بافتار
type: Concept
narrower: بافتار همه‌جوردانه
preferred label: fabric @en