بافت بازمانده
type: Concept
broader: بافت
preferred label: relict texture @en
scope note: بافت اولیۀ ذخایر معدنی که پس از جانشینی کامل یا جزئی باقی مانده است

بافت
type: Concept
narrower: بافت بازمانده
preferred label: texture @en