سنگ رسوبی
type: Concept
preferred label: sedimentary rock @en
related: بافت خمیره‌بنیاد

بافت خمیره‌بنیاد
type: Concept
alternative label: خمیره‌بنیاد
broader: بافت
preferred label: matrix support @en
related: سنگ رسوبی
scope note: بافتی رسوبی که در آن ذرات درشت‌تر در تماس با یکدیگر نیستند و به‌وسیلۀ ذرات ریزتر جدا می‌شوند

بافت
type: Concept
narrower: بافت خمیره‌بنیاد
preferred label: texture @en