بافت نمدی
type: Concept
broader: بافت
preferred label: pilotaxitic texture @en
scope note: بافت ماگمایی تمام‌بلورین و ریزبلورین، شامل بلورهای کوچک درهم‌بافتۀ پلاژیوکلاز

بافت
type: Concept
narrower: بافت نمدی
preferred label: texture @en