سنگ آذرین
type: Concept
preferred label: igneous rock @en
related: بافت نیمه‌پوست‌ماری

بافت نیمه‌پوست‌ماری
type: Concept
broader: بافت
preferred label: subophitic texture @en
related: سنگ آذرین
scope note: بافتی آذرین با بلورهای الواری پلاژیوکاز که فقط بخشی از آنها با دانه‌های پیروکسن احاطه شده است

بافت
type: Concept
narrower: بافت نیمه‌پوست‌ماری
preferred label: texture @en