سنگ دگرگونی
type: Concept
preferred label: metamorphic rock @en
related: بافت هم‌شکفت

بافت هم‌شکفت
type: Concept
broader: بافت
preferred label: homeoblastic texture @en
related: سنگ دگرگونی
scope note: نوعی بافت بلورشکفتی در سنگ‌های دگرگونی‌ای که کانی‌های اصلی هم‌اندازه دارند

بافت
type: Concept
narrower: بافت هم‌شکفت
preferred label: texture @en