ماده باقیمانده
type: Concept
preferred label: relict material @en
related: بازمانده

سنگ دگرگونی
type: Concept
preferred label: metamorphic rock @en
related: بازمانده

بازمانده
type: Concept
preferred label: relict @en
related: ماده باقیمانده
related: سنگ دگرگونی
scope note: ویژگی کانی یا ساختار یا سیمای یک سنگ قدیمی که، با وجود فرایندهای تخریب‌کننده، در سنگ جدید باقی مانده است