باران آتشفشانی
type: Concept
preferred label: volcanic rain @en
related: آتشفشان
related: آتشفشانی
scope note: بارانی که پس از فوران آتشفشان براثر میعان بخارهای همراه فوران می‌بارد

آتشفشانی
type: Concept
preferred label: volcanic @en
related: باران آتشفشانی

آتشفشان
type: Concept
preferred label: volcano @en
related: باران آتشفشانی