دره کافتی بزرگ
type: Concept
preferred label: Great Rift Valley @en
related: دره کافتی کنیا

دره کافتی کنیا
type: Concept
broader: کنیا
preferred label: Kenya Rift valley @en
related: دره کافتی بزرگ
scope note: بخشی از دره کافتی بزرگ در طول شمال و جنوب از طریق غرب مرکز کنیا.

کنیا
type: Concept
narrower: دره کافتی کنیا
preferred label: Kenya @en