ماپوتو موزامبیک
type: Concept
broader: آفریقای شرقی
preferred label: Maputo Mozambique @en
scope note: نامی جدید برای شهر لورنسومارکوس که در خلیج دلاگوا واقع شده است در جنوب موزامبیک.

آفریقای شرقی
type: Concept
narrower: ماپوتو موزامبیک
preferred label: East Africa @en