ناحیه بابور
type: Concept
broader: الجزایر
preferred label: Babor Range @en
related: رشته‌کوه اطلس
scope note: منطقه ساحلی در رشته‌کوه های اطلس کوچک در شمال الجزایر

الجزایر
type: Concept
narrower: ناحیه بابور
preferred label: Algeria @en

رشته‌کوه اطلس
type: Concept
preferred label: Atlas Mountains @en
related: ناحیه بابور