تارفایا مراکش
type: Concept
broader: مراکش
preferred label: Tarfaya Morocco @en
scope note: شهری در منتهاالیه جنوب غربی مراکش. برونبوم اسپانیایی قدیمی.

مراکش
type: Concept
narrower: تارفایا مراکش
preferred label: Morocco @en