گودال فایوم
type: Concept
broader: مصر
preferred label: Fayum Depression @en
scope note: بستر دریاچه قدیمی موریس در شمال مصر علیا جنوب غرب قاهره.

مصر
type: Concept
narrower: گودال فایوم
preferred label: Egypt @en