ونترسدروپ آفریقای جنوبی
type: Concept
broader: ایالت شمالی-غربی آفریقای جنوبی
preferred label: Ventersdorp South Africa @en
scope note: شهری در نزدیکی کلرکسدروپ شمال مرکز آفریقای جنوبی

ایالت شمالی-غربی آفریقای جنوبی
type: Concept
narrower: ونترسدروپ آفریقای جنوبی
preferred label: North-West Province South Africa @en