سازند چشایر
type: Concept
preferred label: Cheshire Formation @en
related: کمربند سنگ سبز بلینگوه

کمربند سنگ سبز بلینگوه
type: Concept
broader: زیمبابوه
preferred label: Belingwe Greenstone Belt @en
related: سازند چشایر
scope note: کراتون زیمباوه (رودزیا قدیمی) شامل گروه مشینگوه آرکئن و سازند منجری و سازند رلینس، سازند زیدربرگ و سازند چشایر که به شکل متغیری در گروه نگزی قرار می گیرد

زیمبابوه
type: Concept
narrower: کمربند سنگ سبز بلینگوه
preferred label: Zimbabwe @en