آلاینده
type: Concept
preferred label: pollutant @en
related: سیمازین

سیمازین
type: Concept
broader: تریازین
preferred label: simazine @en
related: آلاینده
scope note: یک علف کش پیش از جوانه زدن است نام شیمیایی آن 3-کلرو-4-6-بیس(اتیل آمینو)-s-تری آزین است

تریازین
type: Concept
narrower: سیمازین
preferred label: triazine @en