بیلیتون
type: Concept
alternative label: بلی‌تانگ
broader: اندونزی
preferred label: Billiton @en
scope note: جزیره ای در بین سوماترا و جنوب غرب بومئو

اندونزی
type: Concept
narrower: بیلیتون
preferred label: Indonesia @en