میندانائو
type: Concept
broader: جزایر فیلیپین
preferred label: Mindanao @en
scope note: دومین جزیره بزرگ و جنوبی ترین جزیره بزرگ جزایر فیلیپن.

جزایر فیلیپین
type: Concept
narrower: میندانائو
preferred label: Philippine Islands @en