اوسوکی ژاپن
type: Concept
broader: کیوشو
preferred label: Usuki Japan @en
scope note: شهری در تنگه بونگو در شمال شرق کیوشو، جنوب ژاپن

کیوشو
type: Concept
narrower: اوسوکی ژاپن
preferred label: Kyushu @en