جزیره سادو
type: Concept
broader: هونشو
preferred label: Sado Island @en
related: نیگاتا ژاپن
scope note: جزیره کوهستانی در شرق دریای ژاپن کناره شمال غربی ساحل هونشو

نیگاتا ژاپن
type: Concept
preferred label: Niigata Japan @en
related: جزیره سادو

هونشو
type: Concept
narrower: جزیره سادو
preferred label: Honshu @en