میه ژاپن
type: Concept
preferred label: Mie Japan @en
related: خلیج ایس

خلیج ایس
type: Concept
broader: هونشو
preferred label: Ise Bay @en
related: میه ژاپن
scope note: خلیج کوچکی از اقیانوس آرام در جنوب ساحل هونشو.

هونشو
type: Concept
narrower: خلیج ایس
preferred label: Honshu @en