کمربند ریوک
type: Concept
broader: هونشو
preferred label: Ryoke Belt @en
scope note: کمربند دگرگونی ناحیه میدوی مابین یوکوهوما و ناگویا

هونشو
type: Concept
narrower: کمربند ریوک
preferred label: Honshu @en