زمین‌لرزه
type: Concept
preferred label: earthquake @en
related: دشت بیاض

دشت بیاض
type: Concept
broader: ایران
preferred label: Dasht-e-Bayaz @en
related: زمین‌لرزه
scope note: ناحیه ای در بخش شمال شرقی کشور. محل زمین لرزه سال 1968. ایران

ایران
type: Concept
narrower: دشت بیاض
preferred label: Iran @en