توده ترودوس
type: Concept
broader: قبرس
preferred label: Troodos Massif @en
scope note: توده کوهستانی جنوب غرب نیکوزیا که شامل کوه ترودوس، بلندترین قله جزیره می باشد

قبرس
type: Concept
narrower: توده ترودوس
preferred label: Cyprus @en