عجمان
type: Concept
broader: شبه جزیره عربی
preferred label: Ajman @en
scope note: یکی از فدراسیون‌های هفت ایالت در انتهای جنوبی خلیج فارس

شبه جزیره عربی
type: Concept
narrower: عجمان
preferred label: Arabian Peninsula @en