یمن عدن
type: Concept
alternative label: تحت‌الحمایه عدن
broader: یمن
preferred label: Aden Yemen @en
scope note: شهری در خلیج عدن، مهاجر نشینان انگلیسی سابق

یمن
type: Concept
narrower: یمن عدن
preferred label: Yemen @en