غزنه افغانستان
type: Concept
broader: افغانستان
preferred label: Ghazni Afghanistan @en
scope note: ایالتی در شرق مرکز افغانستان. همچنین نام یک شهر.

افغانستان
type: Concept
narrower: غزنه افغانستان
preferred label: Afghanistan @en