کانارا
type: Concept
broader: کارناتاکا هندوستان
preferred label: Kanara @en
scope note: ناحیه‌ای قدیمی شمال کانارا در غرب کاماتا، جنوب غرب هندوستان.

کارناتاکا هندوستان
type: Concept
narrower: کانارا
preferred label: Karnataka India @en