چامبا هند
type: Concept
broader: هیماکال پرادش هند
preferred label: Chamba India @en
scope note: شهر و منطقه ای در شمال غرب هیماچال پرادش، شمال هند

هیماکال پرادش هند
type: Concept
narrower: چامبا هند
preferred label: Himachal Pradesh India @en