سایان
type: Concept
broader: کمربند چین‌خورده سیبری
preferred label: Sayan @en
related: فدراسیون روسیه
scope note: رشته‌کوه شرقی-غربی شمال مغولستان که از جنوب کرانویارسک کرای در غرب از طریق جمهوری حکومتی تورا به غرب ناحیه خودمختار ایرکوتسک در شرق جریان دارد

کمربند چین‌خورده سیبری
type: Concept
narrower: سایان
preferred label: Siberian fold belt @en

فدراسیون روسیه
type: Concept
preferred label: Russian Federation @en
related: سایان