آتشفشان‏نما
type: Concept
preferred label: pseudovolcano @en
related: آتشفشان
scope note: فنجانۀ بزرگی که در ارتباط با فعالیت آتشفشانی نیست

آتشفشان
type: Concept
preferred label: volcano @en
related: آتشفشان‏نما