آتشفشان‌شناسی
type: Concept
preferred label: volcanology @en
related: آتشفشان‏شناس

آتشفشان‏شناس
type: Concept
preferred label: volcanologist @en
related: آتشفشان‌شناسی
related: آتشفشان
scope note: متخصصی که در مورد فوران‌های آتشفشانی مطالعه می‌کند

آتشفشان
type: Concept
preferred label: volcano @en
related: آتشفشان‏شناس